Target
Carboxypeptidase M
Ligand
BDBM50135934
Substrate
Meas. Tech.
ChEMBL_45790 (CHEMBL660086)
IC50
>50000±n/a nM
Citation
 Barrow, JCNantermet, PGStauffer, SRNgo, PLSteinbeiser, MAMao, SSCarroll, SSBailey, CColussi, DBosserman, MBurlein, CCook, JJSitko, GTiller, PRMiller-Stein, CMRose, MMcMasters, DRVacca, JPSelnick, HG Synthesis and evaluation of imidazole acetic acid inhibitors of activated thrombin-activatable fibrinolysis inhibitor as novel antithrombotics. J Med Chem 46:5294-7 (2003)  
Target
Name:
Carboxypeptidase M
Synonyms:
CBPM_HUMAN | CPM
Type:
PROTEIN
Mol. Mass.:
50519.81
Organism:
Homo sapiens (Human)
Description:
ChEMBL_45790
Residue:
443
  
Inhibitor
Name:
BDBM50135934
Synonyms:
3-(6-Amino-pyridin-3-yl)-2-[1-(3-methyl-butyl)-1H-imidazol-4-yl]-propionic acid | CHEMBL68399
Type:
Small organic molecule
Emp. Form.:
C16H22N4O2
Mol. Mass.:
302.3715
SMILES:
CC(C)CCn1cnc(c1)C(Cc1ccc(N)nc1)C(O)=O
: