Target
Vascular endothelial growth factor receptor 2
Ligand
BDBM50136020
Substrate
Meas. Tech.
ChEMBL_214107 (CHEMBL820693)
IC50
35±n/a nM
Citation
 Gingrich, DEReddy, DRIqbal, MASingh, JAimone, LDAngeles, TSAlbom, MYang, SAtor, MAMeyer, SLRobinson, CRuggeri, BADionne, CAVaught, JLMallamo, JPHudkins, RL A new class of potent vascular endothelial growth factor receptor tyrosine kinase inhibitors: structure-activity relationships for a series of 9-alkoxymethyl-12-(3-hydroxypropyl)indeno[2,1-a]pyrrolo[3,4-c]carbazole-5-ones and the identification of CEP-5214 and its dimethylglycine ester prodrug clin J Med Chem 46:5375-88 (2003)  
Target
Name:
Vascular endothelial growth factor receptor 2
Synonyms:
CD_antigen=CD309 Fetal liver kinase 1 (FLK-1) KDR Protein-tyrosine kinase receptor Flk-1 VEGFR-2 VEGFR2 Vascular Endothelial Growth Factor Receptor Kinase 2 Vascular endothelial growth factor receptor 2 (KDR) Vascular endothelial growth factor receptor 2 (VEGFR2) Vascular endothelial growth factor receptor-2 (VEGFR-2)
Type:
Receptor Tyrosine Kinase
Mol. Mass.:
151510.97
Organism:
Homo sapiens (Human)
Description:
P35968
Residue:
1356
  
Inhibitor
Name:
BDBM50136020
Synonyms:
9-(1-ethylpropoxymethyl)-12-(3-hydroxypropyl)-6,7,12,13-tetrahydro-5H-indeno[2,1-a]pyrrolo[4,3-c]carbazol-5-one | CHEMBL149742
Type:
Small organic molecule
Emp. Form.:
C30H32N2O3
Mol. Mass.:
468.5867
SMILES:
CCC(CC)OCc1ccc2n(CCCO)c3c4Cc5ccccc5-c4c4C(=O)NCc4c3c2c1
: