Target
Estrogen receptor
Ligand
BDBM50136243
Substrate
Meas. Tech.
ChEBML_67036
Ki
8±n/a nM
Citation
 Lugar, CWMagee, DAdrian, MDShetler, PBryant, HUDodge, JA B-ring unsaturated estrogens: biological evaluation of 17alpha-Dihydroequilein and novel B-Nor-6-thiaequilenins as tissue selective estrogens. Bioorg Med Chem Lett 13:4281-4 (2003)  
Target
Name:
Estrogen receptor
Synonyms:
ER ESR ESR1_HUMAN Estrogen receptor Estrogen receptor (ER-alpha) Estrogen receptor alpha (ER) Nuclear receptor subfamily 3 group A member 1
Type:
Protein
Mol. Mass.:
66230.44
Organism:
Homo sapiens (Human)
Description:
P03372
Residue:
595
  
Inhibitor
Name:
BDBM50136243
Synonyms:
(13S,14S,17R)-13-Methyl-7,8,9,11,12,13,14,15,16,17-decahydro-6H-cyclopenta[a]phenanthrene-3,17-diol | CHEMBL135236
Type:
Small organic molecule
Emp. Form.:
C18H20O2
Mol. Mass.:
268.3502
SMILES:
C[C@]12CCc3c(ccc4cc(O)ccc34)[C@@H]1CC[C@H]2O
: