Target
Melatonin receptor type 1B
Ligand
BDBM50136403
Substrate
Meas. Tech.
ChEBML_105266
Ki
2.8±n/a nM
Citation
 Sun, LQChen, JMattson, RJEpperson, JRDeskus, JALi, WSTakaki, KHodges, DBIben, LMahle, CDOrtiz, AMolstad, DRyan, EYeleswaram, KXu, CLuo, G Heterocyclic aminopyrrolidine derivatives as melatoninergic agents. Bioorg Med Chem Lett 13:4381-4 (2003)  
Target
Name:
Melatonin receptor type 1B
Synonyms:
MTNR1B Mel-1B-R Melatonin 1B Melatonin receptor type 1B | Melatonin receptor type 2 (MT2)
Type:
Enzyme
Mol. Mass.:
40203.54
Organism:
Homo sapiens (Human)
Description:
P49286
Residue:
362
  
Inhibitor
Name:
BDBM50136403
Synonyms:
CHEMBL139439 | Cyclopropanecarboxylic acid [(S)-1-(2,3-dihydro-benzofuran-4-yl)-pyrrolidin-3-yl]-amide
Type:
Small organic molecule
Emp. Form.:
C16H20N2O2
Mol. Mass.:
272.3422
SMILES:
O=C(N[C@H]1CCN(C1)c1cccc2OCCc12)C1CC1
: