Target
5-hydroxytryptamine receptor 1A
Ligand
BDBM100152
Substrate
Meas. Tech.
ChEBML_925
Ki
>10000±n/a nM
Citation
 Grella, BTeitler, MSmith, CHerrick-Davis, KGlennon, RA Binding of beta-carbolines at 5-HT(2) serotonin receptors. Bioorg Med Chem Lett 13:4421-5 (2003)  
Target
Name:
5-hydroxytryptamine receptor 1A
Synonyms:
5-HT-1A 5-hydroxytryptamine receptor 1A (5-HT-1A) ADRB2RL1 Dopamine D2 receptor and serotonin 1a receptor HTR1A | Serotonin receptor 1A
Type:
Mol. Mass.:
46122.49
Organism:
Homo sapiens (Human)
Description:
Residue:
422
  
Inhibitor
Name:
BDBM100152
Synonyms:
7-methoxy-1-methyl-9H-beta-carboline;hydrochloride HARMINE MLS002153910 cid_5359389
Type:
Small organic molecule
Emp. Form.:
C13H12N2O
Mol. Mass.:
212.2472
SMILES:
COc1ccc2c(c1)[nH]c1c(C)nccc21
: