Target
5'-methylthioadenosine/S-adenosylhomocysteine nucleosidase
Ligand
BDBM50136942
Substrate
Meas. Tech.
ChEMBL_103130 (CHEMBL712301)
Ki
12.5±n/a nM
Citation
 Li, XChu, SFeher, VAKhalili, MNie, ZMargosiak, SNikulin, VLevin, JSprankle, KGTedder, MEAlmassy, RAppelt, KYager, KM Structure-based design, synthesis, and antimicrobial activity of indazole-derived SAH/MTA nucleosidase inhibitors. J Med Chem 46:5663-73 (2003)  
Target
Name:
5'-methylthioadenosine/S-adenosylhomocysteine nucleosidase
Synonyms:
5 -methylthioadenosine nucleosidase 5'-methylthioadenosine/S-adenosylhomocysteine nucleosidase MTA/SAH nucleosidase MTNN_ECOLI P46 mtn pfs | yadA
Type:
Enzyme
Mol. Mass.:
24347.14
Organism:
Escherichia coli (strain K12)
Description:
P0AF12
Residue:
232
  
Inhibitor
Name:
BDBM50136942
Synonyms:
4'-Chloro-biphenyl-3-sulfonic acid (3-chloro-7-isobutylamino-1H-indazol-5-yl)-amide | CHEMBL156734
Type:
Small organic molecule
Emp. Form.:
C23H22Cl2N4O2S
Mol. Mass.:
489.417
SMILES:
CC(C)CNc1cc(NS(=O)(=O)c2cccc(c2)-c2ccc(Cl)cc2)cc2c(Cl)[nH]nc12
: