Target
Vascular endothelial growth factor receptor 1
Ligand
BDBM50137173
Substrate
Meas. Tech.
ChEMBL_213951 (CHEMBL811929)
IC50
4±n/a nM
Citation
 Munchhof, MJBeebe, JSCasavant, JMCooper, BADoty, JLHigdon, RCHillerman, SMSoderstrom, CIKnauth, EAMarx, MARossi, AMSobolov, SBSun, J Design and SAR of thienopyrimidine and thienopyridine inhibitors of VEGFR-2 kinase activity. Bioorg Med Chem Lett 14:21-4 (2003)  
Target
Name:
Vascular endothelial growth factor receptor 1
Synonyms:
FLT FRT Fms-like tyrosine kinase 1 Tyrosine-protein kinase FRT VEGFR-1 VGFR1_HUMAN Vascular endothelial growth factor receptor 1 (FLT1) Vascular endothelial growth factor receptor 1 and 2 (Flt-1 and KDR) Vascular permeability factor receptor vascular endothelial growth factor/vascular permeability factor receptor
Type:
Receptor Tyrosine Kinase
Mol. Mass.:
150800.23
Organism:
Homo sapiens (Human)
Description:
P17948
Residue:
1338
  
Inhibitor
Name:
BDBM50137173
Synonyms:
CHEMBL312818 | N*6*-Imidazol-1-yl-N*4*-(1H-indol-5-yl)-N*6*-(3-phenyl-propyl)-thieno[3,2-d]pyrimidine-4,6-diamine
Type:
Small organic molecule
Emp. Form.:
C26H23N7S
Mol. Mass.:
465.573
SMILES:
C(CN(c1cc2ncnc(Nc3ccc4[nH]ccc4c3)c2s1)n1ccnc1)Cc1ccccc1
: