Target
Vascular endothelial growth factor receptor 1
Ligand
BDBM50137202
Substrate
Meas. Tech.
ChEBML_213951
IC50
3±n/a nM
Citation
 Munchhof, MJBeebe, JSCasavant, JMCooper, BADoty, JLHigdon, RCHillerman, SMSoderstrom, CIKnauth, EAMarx, MARossi, AMSobolov, SBSun, J Design and SAR of thienopyrimidine and thienopyridine inhibitors of VEGFR-2 kinase activity. Bioorg Med Chem Lett 14:21-4 (2003)  
Target
Name:
Vascular endothelial growth factor receptor 1
Synonyms:
FLT FRT Fms-like tyrosine kinase 1 Tyrosine-protein kinase FRT VEGFR-1 VGFR1_HUMAN Vascular endothelial growth factor receptor 1 (FLT1) Vascular endothelial growth factor receptor 1 and 2 (Flt-1 and KDR) Vascular permeability factor receptor vascular endothelial growth factor/vascular permeability factor receptor
Type:
Receptor Tyrosine Kinase
Mol. Mass.:
150800.23
Organism:
Homo sapiens (Human)
Description:
P17948
Residue:
1338
  
Inhibitor
Name:
BDBM50137202
Synonyms:
2-(Methyl-{4-[7-(2-methyl-1H-indol-5-ylamino)-thieno[3,2-b]pyridin-2-yl]-benzyl}-amino)-ethanol | CHEMBL81375
Type:
Small organic molecule
Emp. Form.:
C26H26N4OS
Mol. Mass.:
442.576
SMILES:
CN(CCO)Cc1ccc(cc1)-c1cc2nccc(Nc3ccc4[nH]c(C)cc4c3)c2s1
: