Target
Matrix metalloproteinase-26
Ligand
BDBM50137282
Substrate
Meas. Tech.
ChEBML_104566
IC50
97±n/a nM
Citation
 Ma, DWu, WYang, GLi, JLi, JYe, Q Tetrahydroisoquinoline based sulfonamide hydroxamates as potent matrix metalloproteinase inhibitors. Bioorg Med Chem Lett 14:47-50 (2003)  
Target
Name:
Matrix metalloproteinase-26
Synonyms:
Endometase MMP26 Matrilysin-2 Matrix metalloproteinase-26
Type:
PROTEIN
Mol. Mass.:
29707.55
Organism:
Homo sapiens (Human)
Description:
ChEMBL_806653
Residue:
261
  
Inhibitor
Name:
BDBM50137282
Synonyms:
6-Hydroxy-2-(toluene-4-sulfonyl)-1,2,3,4-tetrahydro-isoquinoline-1-carboxylic acid hydroxyamide N,6-dihydroxy-2-tosyl-1,2,3,4-tetrahydroisoquinoline-1-carboxamide
Type:
Small organic molecule
Emp. Form.:
C17H18N2O5S
Mol. Mass.:
362.4
SMILES:
Cc1ccc(cc1)S(=O)(=O)N1CCc2cc(O)ccc2C1C(=O)NO
: