Target
Peptide deformylase
Ligand
BDBM50137333
Substrate
Meas. Tech.
ChEBML_154314
IC50
2±n/a nM
Citation
 East, SPBeckett, RPBrookings, DCClements, JMDoel, SKeavey, KPain, GSmith, HKThomas, WThompson, AJTodd, RSWhittaker, M Peptide deformylase inhibitors with activity against respiratory tract pathogens. Bioorg Med Chem Lett 14:59-62 (2003)  
Target
Name:
Peptide deformylase
Synonyms:
3.5.1.88 BON94_18585 D9G11_25760 FORC82_p394 Polypeptide deformylase def | def_2
Type:
Mol. Mass.:
16901.39
Organism:
Escherichia coli
Description:
Residue:
150
  
Inhibitor
Name:
BDBM50137333
Synonyms:
(R)-2-Cyclopentylmethyl-N-{(S)-1-[3-fluoro-4-((S)-2-hydroxymethyl-pyrrolidin-1-yl)-benzoyl]-2,2-dimethyl-propyl}-3-(formyl-hydroxy-amino)-propionamide | CHEMBL348314
Type:
Small organic molecule
Emp. Form.:
C27H40FN3O5
Mol. Mass.:
505.622
SMILES:
CC(C)(C)[C@H](NC(=O)[C@H](CC1CCCC1)CN(O)C=O)C(=O)c1ccc(N2CCC[C@H]2CO)c(F)c1
: