Target
Prostaglandin G/H synthase 1
Ligand
BDBM50137424
Substrate
Meas. Tech.
ChEBML_158583
IC50
1500±n/a nM
Citation
 Li, JDeMello, KMCheng, HSakya, SMBronk, BSRafka, RJJaynes, BHZiegler, CBKilroy, CMann, DWNimz, ELLynch, MPHaven, MLKolosko, NLMinich, MLLi, CDutra, JKRast, BCrosson, RMMorton, BJKirk, GWCallaghan, KMKoss, DAShavnya, ALund, LASeibel, SBPetras, CFSilvia, A Discovery of a potent, selective and orally active canine COX-2 inhibitor, 2-(3-difluoromethyl-5-phenyl-pyrazol-1-yl)-5-methanesulfonyl-pyridine. Bioorg Med Chem Lett 14:95-8 (2003)  
Target
Name:
Prostaglandin G/H synthase 1
Synonyms:
COX1 PGH synthase 1 PGHS-1 PTGS1 Prostaglandin H2 synthase 1 | Prostaglandin-endoperoxide synthase 1
Type:
PROTEIN
Mol. Mass.:
69314.28
Organism:
Canis familiaris
Description:
ChEMBL_327426
Residue:
603
  
Inhibitor
Name:
BDBM50137424
Synonyms:
2-[4-Chloro-5-(3-chloro-4-methoxy-phenyl)-3-difluoromethyl-pyrazol-1-yl]-5-methanesulfonyl-pyridine | CHEMBL368724
Type:
Small organic molecule
Emp. Form.:
C17H13Cl2F2N3O3S
Mol. Mass.:
448.271
SMILES:
COc1ccc(cc1Cl)-c1c(Cl)c(nn1-c1ccc(cn1)S(C)(=O)=O)C(F)F
: