Target
Prostaglandin G/H synthase 2
Ligand
BDBM50137422
Substrate
Meas. Tech.
ChEBML_159595
IC50
390±n/a nM
Citation
 Li, JDeMello, KMCheng, HSakya, SMBronk, BSRafka, RJJaynes, BHZiegler, CBKilroy, CMann, DWNimz, ELLynch, MPHaven, MLKolosko, NLMinich, MLLi, CDutra, JKRast, BCrosson, RMMorton, BJKirk, GWCallaghan, KMKoss, DAShavnya, ALund, LASeibel, SBPetras, CFSilvia, A Discovery of a potent, selective and orally active canine COX-2 inhibitor, 2-(3-difluoromethyl-5-phenyl-pyrazol-1-yl)-5-methanesulfonyl-pyridine. Bioorg Med Chem Lett 14:95-8 (2003)  
Target
Name:
Prostaglandin G/H synthase 2
Synonyms:
Cyclooxygenase-2 | Prostaglandin G/H synthase-2
Type:
PROTEIN
Mol. Mass.:
68982.35
Organism:
Canis familiaris
Description:
ChEMBL_344386
Residue:
604
  
Inhibitor
Name:
BDBM50137422
Synonyms:
2-[3-Difluoromethyl-5-(2-fluoro-4-methoxy-phenyl)-pyrazol-1-yl]-5-methanesulfonyl-pyridine | CHEMBL367617
Type:
Small organic molecule
Emp. Form.:
C17H14F3N3O3S
Mol. Mass.:
397.372
SMILES:
COc1ccc(-c2cc(nn2-c2ccc(cn2)S(C)(=O)=O)C(F)F)c(F)c1
: