Target
Genome polyprotein
Ligand
BDBM50137499
Substrate
Meas. Tech.
ChEBML_164133
IC50
>500000±n/a nM
Citation
 Beaulieu, PLBös, MBousquet, YFazal, GGauthier, JGillard, JGoulet, SLaPlante, SPoupart, MALefebvre, SMcKercher, GPellerin, CAustel, VKukolj, G Non-nucleoside inhibitors of the hepatitis C virus NS5B polymerase: discovery and preliminary SAR of benzimidazole derivatives. Bioorg Med Chem Lett 14:119-24 (2003)  
Target
Name:
Genome polyprotein
Synonyms:
POLG_POL1M | Poliovirus type 1 polyprotein
Type:
PROTEIN
Mol. Mass.:
246555.04
Organism:
Poliovirus type 1 (strain Mahoney)
Description:
ChEMBL_417449
Residue:
2209
  
Inhibitor
Name:
BDBM50137499
Synonyms:
1-(2-Methyl-cyclohexyl)-2-pyridin-2-yl-1H-benzoimidazole-5-carboxylic acid | CHEMBL174542
Type:
Small organic molecule
Emp. Form.:
C20H21N3O2
Mol. Mass.:
335.3996
SMILES:
CC1CCCCC1n1c(nc2cc(ccc12)C(O)=O)-c1ccccn1
: