Target
5-hydroxytryptamine receptor 1F
Ligand
BDBM50137538
Substrate
Meas. Tech.
ChEMBL_107124 (CHEMBL718155)
EC50
277±n/a nM
Citation
 Mathes, BMHudziak, KJSchaus, JMXu, YCNelson, DLWainscott, DBNutter, SEGough, WHBranchek, TAZgombick, JMFilla, SA Substituted furo[3,2-b]pyridines: novel bioisosteres of 5-HT 1F receptor agonists. Bioorg Med Chem Lett 14:167-70 (2003)  
Target
Name:
5-hydroxytryptamine receptor 1F
Synonyms:
5-HT-1F 5-hydroxytryptamine receptor 1F HTR1EL Serotonin (5-HT) receptor Serotonin receptor 1F
Type:
Enzyme Catalytic Domain
Mol. Mass.:
41724.68
Organism:
Homo sapiens (Human)
Description:
5-HT1F HTR1F HUMAN::P30939
Residue:
366
  
Inhibitor
Name:
BDBM50137538
Synonyms:
2-Chloro-4-fluoro-N-[3-(1-methyl-piperidin-4-yl)-furo[3,2-b]pyridin-5-yl]-benzamide | CHEMBL177238
Type:
Small organic molecule
Emp. Form.:
C20H19ClFN3O2
Mol. Mass.:
387.835
SMILES:
CN1CCC(CC1)c1coc2ccc(NC(=O)c3ccc(F)cc3Cl)nc12
: