Target
Cathepsin B
Ligand
BDBM50137733
Substrate
Meas. Tech.
ChEBML_47629
Ki
1.6±n/a nM
Citation
 Victor, FLamar, JSnyder, NYip, YGuo, DYumibe, NJohnson, RBWang, QMGlass, JIChen, SH P1 and P3 optimization of novel bicycloproline P2 bearing tetrapeptidyl alpha-ketoamide based HCV protease inhibitors. Bioorg Med Chem Lett 14:257-61 (2003)  
Target
Name:
Cathepsin B
Synonyms:
APP secretase CATB_HUMAN CTSB Cathepsin B light chain | Cathepsin B1
Type:
Enzyme
Mol. Mass.:
37819.69
Organism:
Homo sapiens (Human)
Description:
gi_63102437
Residue:
339
  
Inhibitor
Name:
BDBM50137733
Synonyms:
(1S,5S,6R)-2-((S)-3,3-Dimethyl-2-{(S)-3-methyl-2-[(pyrazine-2-carbonyl)-amino]-butyrylamino}-butyryl)-octahydro-cyclopenta[c]pyrrole-1-carboxylic acid [1-((S)-cyclopropylaminooxalyl)-butyl]-amide | CHEMBL86453
Type:
Small organic molecule
Emp. Form.:
C33H49N7O6
Mol. Mass.:
639.7855
SMILES:
CCC[C@H](NC(=O)[C@@H]1[C@H]2CCC[C@H]2CN1C(=O)[C@@H](NC(=O)[C@@H](NC(=O)c1cnccn1)C(C)C)C(C)(C)C)C(=O)C(=O)NC1CC1
: