Target
Cathepsin B
Ligand
BDBM50137720
Substrate
Meas. Tech.
ChEBML_47629
Ki
4±n/a nM
Citation
 Victor, FLamar, JSnyder, NYip, YGuo, DYumibe, NJohnson, RBWang, QMGlass, JIChen, SH P1 and P3 optimization of novel bicycloproline P2 bearing tetrapeptidyl alpha-ketoamide based HCV protease inhibitors. Bioorg Med Chem Lett 14:257-61 (2003)  
Target
Name:
Cathepsin B
Synonyms:
APP secretase CATB_HUMAN CTSB Cathepsin B light chain | Cathepsin B1
Type:
Enzyme
Mol. Mass.:
37819.69
Organism:
Homo sapiens (Human)
Description:
gi_63102437
Residue:
339
  
Inhibitor
Name:
BDBM50137720
Synonyms:
(1S,3aR,6aS)-2-((S)-3-Methyl-2-{(S)-3-methyl-2-[(pyrazine-2-carbonyl)-amino]-butyrylamino}-butyryl)-octahydro-cyclopenta[c]pyrrole-1-carboxylic acid (1-cyclopropylaminooxalyl-butyl)-amide CHEMBL264623
Type:
Small organic molecule
Emp. Form.:
C32H47N7O6
Mol. Mass.:
625.7589
SMILES:
CCCC(NC(=O)[C@@H]1[C@H]2CCC[C@H]2CN1C(=O)[C@@H](NC(=O)[C@@H](NC(=O)c1cnccn1)C(C)C)C(C)C)C(=O)C(=O)NC1CC1
: