Target
UDP-N-acetylmuramoyl-tripeptide--D-alanyl-D-alanine ligase
Ligand
BDBM50137760
Substrate
Meas. Tech.
ChEBML_212267
IC50
300±n/a nM
Citation
 Gu, YGFlorjancic, ASClark, RFZhang, TCooper, CSAnderson, DDLerner, CGMcCall, JOCai, YBlack-Schaefer, CLStamper, GFHajduk, PJBeutel, BA Structure-activity relationships of novel potent MurF inhibitors. Bioorg Med Chem Lett 14:267-70 (2003)  
Target
Name:
UDP-N-acetylmuramoyl-tripeptide--D-alanyl-D-alanine ligase
Synonyms:
MurF (S. pneumoniae) UDP-N-acetylmuramoylalanine-D-glutamyl-lysine-D-alanyl-D-alanine ligase
Type:
Protein
Mol. Mass.:
50482.72
Organism:
Streptococcus pneumoniae (Firmicutes)
Description:
S. pneumoniae MurF
Residue:
457
  
Inhibitor
Name:
BDBM50137760
Synonyms:
2,4-dichloro-N-(3-cyano-5,6-dihydro-4H-cyclopenta[b]thiophen-2-yl)-5-(morpholine-4-sulfonyl)-benzamide MurF inhibitor, 9
Type:
Small organic molecule
Emp. Form.:
C19H17Cl2N3O4S2
Mol. Mass.:
486.392
SMILES:
Clc1cc(Cl)c(cc1C(=O)Nc1sc2CCCc2c1C#N)S(=O)(=O)N1CCOCC1
: