Target
Histone deacetylase 1
Ligand
BDBM50137850
Substrate
Meas. Tech.
ChEBML_87538
IC50
5000±n/a nM
Citation
 Vaisburg, ABernstein, NFrechette, SAllan, MAbou-Khalil, ELeit, SMoradei, OBouchain, GWang, JWoo, SHFournel, MYan, PTTrachy-Bourget, MCKalita, ABeaulieu, CLi, ZMacLeod, ARBesterman, JMDelorme, D (2-amino-phenyl)-amides of omega-substituted alkanoic acids as new histone deacetylase inhibitors. Bioorg Med Chem Lett 14:283-7 (2003)  
Target
Name:
Histone deacetylase 1
Synonyms:
Cereblon/Histone deacetylase 1 HDAC1 Histone deacetylase 1 (HDAC1) RPD3L1
Type:
Enzyme
Mol. Mass.:
55090.27
Organism:
Homo sapiens (Human)
Description:
Q13547
Residue:
482
  
Inhibitor
Name:
BDBM50137850
Synonyms:
6-(5,7-Dioxo-5,7-dihydro-pyrrolo[3,4-b]pyridin-6-yl)-hexanoic acid (2-amino-phenyl)-amide | CHEMBL97061
Type:
Small organic molecule
Emp. Form.:
C19H20N4O3
Mol. Mass.:
352.3871
SMILES:
Nc1ccccc1NC(=O)CCCCCN1C(=O)c2cccnc2C1=O
: