Target
Vasopressin V2 receptor
Ligand
BDBM50137944
Substrate
Meas. Tech.
ChEBML_215011
IC50
100±n/a nM
Citation
 Cho, HMurakami, KNakanishi, HFujisawa, AIsoshima, HNiwa, MHayakawa, KHase, YUchida, IWatanabe, HWakitani, KAisaka, K Synthesis and structure-activity relationships of 5,6,7,8-tetrahydro-4H-thieno[3,2-b]azepine derivatives: novel arginine vasopressin antagonists. J Med Chem 47:101-9 (2003)  
Target
Name:
Vasopressin V2 receptor
Synonyms:
AVPR V2 Avpr2 V2R_RAT Vasopressin receptor
Type:
G-protein coupled receptor
Mol. Mass.:
40761.85
Organism:
Rattus norvegicus (Rat)
Description:
Residue:
371
  
Inhibitor
Name:
BDBM50137944
Synonyms:
Biphenyl-2-carboxylic acid (4-{8-[2-(4-methyl-[1,4]diazepan-1-yl)-acetyl]-5,6,7,8-tetrahydro-1-thia-4,8-diaza-azulene-4-carbonyl}-phenyl)-amide | CHEMBL366816
Type:
Small organic molecule
Emp. Form.:
C35H37N5O3S
Mol. Mass.:
607.765
SMILES:
CN1CCCN(CC(=O)N2CCCN(C(=O)c3ccc(NC(=O)c4ccccc4-c4ccccc4)cc3)c3ccsc23)CC1
: