Target
Kappa-type opioid receptor
Ligand
BDBM50137992
Substrate
Meas. Tech.
ChEMBL_146368 (CHEMBL759288)
Ki
17±n/a nM
Citation
 Zhang, AXiong, WBidlack, JMHilbert, JEKnapp, BIWentland, MPNeumeyer, JL 10-Ketomorphinan and 3-substituted-3-desoxymorphinan analogues as mixed kappa and micro opioid ligands: synthesis and biological evaluation of their binding affinity at opioid receptors. J Med Chem 47:165-74 (2003)  
Target
Name:
Kappa-type opioid receptor
Synonyms:
Kappa Opioid Receptor OPRK1 Opiate Kappa 1 | mu/kappa opioid receptor
Type:
G Protein-Coupled Receptor (GPCR)
Mol. Mass.:
42744.99
Organism:
Cavia porcellus (domestic guinea pig)
Description:
P41144
Residue:
380
  
Inhibitor
Name:
BDBM50137992
Synonyms:
3-Hydroxy-10-keto-N-(2-methoxyethyl)morphinan | CHEMBL432873
Type:
Small organic molecule
Emp. Form.:
C19H25NO3
Mol. Mass.:
315.4067
SMILES:
COCCN1CC[C@]23CCCC[C@H]2[C@H]1C(=O)c1ccc(O)cc31
: