Target
Mu-type opioid receptor
Ligand
BDBM50135800
Substrate
Meas. Tech.
ChEMBL_145149 (CHEMBL755953)
Ki
0.06±n/a nM
Citation
 Zhang, AXiong, WBidlack, JMHilbert, JEKnapp, BIWentland, MPNeumeyer, JL 10-Ketomorphinan and 3-substituted-3-desoxymorphinan analogues as mixed kappa and micro opioid ligands: synthesis and biological evaluation of their binding affinity at opioid receptors. J Med Chem 47:165-74 (2003)  
Target
Name:
Mu-type opioid receptor
Synonyms:
M-OR-1 Mu opioid receptor OPIATE Mu OPRM_CAVPO
Type:
Enzyme Catalytic Domain
Mol. Mass.:
11165.58
Organism:
GUINEA PIG
Description:
P97266
Residue:
98
  
Inhibitor
Name:
BDBM50135800
Synonyms:
(-)-3-Hydroxy-N-cycloproypylmethylmorphinan Mandelate 3-Hydroxy-N-cyclopropylmethylmorphinan CYCLORPHAN US10736890, Compound TABLE B.6 US9656961, Example 00123
Type:
Small organic molecule
Emp. Form.:
C20H27NO
Mol. Mass.:
297.4345
SMILES:
Oc1ccc2C[C@@H]3[C@@H]4CCCC[C@]4(CCN3CC3CC3)c2c1
: