Target
Polyprenyl synthetase family protein
Ligand
BDBM50135833
Substrate
Meas. Tech.
ChEMBL_69823 (CHEMBL679572)
IC50
360±n/a nM
Citation
 Ghosh, SChan, JMLea, CRMeints, GALewis, JCTovian, ZSFlessner, RMLoftus, TCBruchhaus, IKendrick, HCroft, SLKemp, RGKobayashi, SNozaki, TOldfield, E Effects of bisphosphonates on the growth of Entamoeba histolytica and Plasmodium species in vitro and in vivo. J Med Chem 47:175-87 (2003)  
Target
Name:
Polyprenyl synthetase family protein
Synonyms:
Farnesyl diphosphate synthase | Farnesyl pyrophosphate synthase
Type:
PROTEIN
Mol. Mass.:
41078.35
Organism:
Plasmodium falciparum (isolate 3D7)
Description:
ChEMBL_330072
Residue:
362
  
Inhibitor
Name:
BDBM50135833
Synonyms:
(2-methylbutyl)aminomethylene-1,1-bisphosphonate (Bis-phosphono-methyl)-(2-methyl-butyl)-ammonium [(2-Methyl-butylamino)-phosphono-methyl]-phosphonic acid
Type:
Small organic molecule
Emp. Form.:
C6H17NO6P2
Mol. Mass.:
261.1498
SMILES:
CCC(C)CN=C(P(O)(O)O)P(O)(O)=O
: