Target
Tissue-type plasminogen activator
Ligand
BDBM50138154
Substrate
Meas. Tech.
ChEBML_208050
IC50
>450±n/a nM
Citation
 Zhao, GBolton, SAKwon, CHartl, KSSeiler, SMSlusarchyk, WASutton, JCBisacchi, GS Synthesis of potent and selective 2-azepanone inhibitors of human tryptase. Bioorg Med Chem Lett 14:309-12 (2003)  
Target
Name:
Tissue-type plasminogen activator
Synonyms:
Alteplase Reteplase Thrombin receptor protein Tissue-type plasminogen activator (tPA) t-PA t-plasminogen activator
Type:
Enzyme
Mol. Mass.:
62931.08
Organism:
Homo sapiens (Human)
Description:
Residue:
562
  
Inhibitor
Name:
BDBM50138154
Synonyms:
Biphenyl-4-carboxylic acid {1-[(5-aminomethyl-2-methyl-phenylcarbamoyl)-methyl]-2-oxo-azepan-3-yl}-amide | CHEMBL104064
Type:
Small organic molecule
Emp. Form.:
C29H32N4O3
Mol. Mass.:
484.5894
SMILES:
Cc1ccc(CN)cc1NC(=O)CN1CCCCC(NC(=O)c2ccc(cc2)-c2ccccc2)C1=O
: