Target
Tryptase beta-2/delta/gamma
Ligand
BDBM50138161
Substrate
Meas. Tech.
ChEMBL_210689 (CHEMBL817287)
IC50
200±n/a nM
Citation
 Zhao, GBolton, SAKwon, CHartl, KSSeiler, SMSlusarchyk, WASutton, JCBisacchi, GS Synthesis of potent and selective 2-azepanone inhibitors of human tryptase. Bioorg Med Chem Lett 14:309-12 (2003)  
Target
Name:
Tryptase beta-2/delta/gamma
Synonyms:
Tryptase
Type:
Mol. Mass.:
Description:
ASSAY_ID of ChEMBL is 1510505
Components:
This complex has 3 components.
Component 1
Name:
Tryptase gamma
Synonyms:
PRSS31 TMT TRYG1_HUMAN Tryptase Tryptase gamma heavy chain | Tryptase gamma light chain
Type:
PROTEIN
Mol. Mass.:
33817.52
Organism:
Homo sapiens (Human)
Description:
ChEMBL_210833
Residue:
321
  
Component 2
Name:
Tryptase beta-2
Synonyms:
TPS2 TRYB2_HUMAN Tryptase II Tryptase-2
Type:
PROTEIN
Mol. Mass.:
30518.79
Organism:
Homo sapiens (Human)
Description:
ChEMBL_210702
Residue:
275
  
Component 3
Name:
Tryptase delta
Synonyms:
Delta-tryptase Mast cell mMCP-7-like TRYD_HUMAN Tryptase-3
Type:
PROTEIN
Mol. Mass.:
26578.73
Organism:
Homo sapiens (Human)
Description:
ChEMBL_104777
Residue:
242
  
Inhibitor
Name:
BDBM50138161
Synonyms:
CHEMBL321466 | N-{1-[(3-Aminomethyl-phenylcarbamoyl)-methyl]-2-oxo-azepan-3-yl}-3,3-diphenyl-propionamide
Type:
Small organic molecule
Emp. Form.:
C30H34N4O3
Mol. Mass.:
498.616
SMILES:
NCc1cccc(NC(=O)CN2CCCCC(NC(=O)CC(c3ccccc3)c3ccccc3)C2=O)c1
: