Target
Integrin alpha-5/beta-1
Ligand
BDBM50138318
Substrate
Meas. Tech.
ChEMBL_32643 (CHEMBL642138)
IC50
0.180000±n/a nM
Citation
 Smallheer, JMWeigelt, CAWoerner, FJWells, JSDaneker, WFMousa, SAWexler, RRJadhav, PK Synthesis and biological evaluation of nonpeptide integrin antagonists containing spirocyclic scaffolds. Bioorg Med Chem Lett 14:383-7 (2003)  
Target
Name:
Integrin alpha-5/beta-1
Synonyms:
Fibronectin receptor alpha/beta ITGA5/ITGB1
Type:
Enzyme
Mol. Mass.:
Description:
Components:
This complex has 2 components.
Component 1
Name:
Integrin alpha-5
Synonyms:
CD49 antigen-like family member E FNRA Fibronectin receptor subunit alpha ITGA5 Integrin alpha-F | VLA-5
Type:
Single-pass type I membrane protein
Mol. Mass.:
114523.00
Organism:
Homo sapiens (Human)
Description:
Residue:
1049
  
Component 2
Name:
Integrin beta-1
Synonyms:
CD_antigen=CD29 Fibronectin receptor beta GPIIA ITGB1 MDF2 | MSK12
Type:
Enzyme
Mol. Mass.:
88400.38
Organism:
Homo sapiens (Human)
Description:
P05556
Residue:
798
  
Inhibitor
Name:
BDBM50138318
Synonyms:
(5S,8S)-3-[(S)-2-Carboxy-2-(2,4,6-trimethyl-benzenesulfonylamino)-ethylcarbamoyl]-8-(pyridin-2-ylaminomethyl)-1-oxa-2,7-diaza-spiro[4.4]non-2-ene-7-carboxylic acid benzyl ester | CHEMBL338439
Type:
Small organic molecule
Emp. Form.:
C33H38N6O8S
Mol. Mass.:
678.755
SMILES:
Cc1cc(C)c(c(C)c1)S(=O)(=O)N[C@@H](CNC(=O)C1=NO[C@@]2(C[C@@H](CNc3ccccn3)N(C2)C(=O)OCc2ccccc2)C1)C(O)=O
: