Target
Histone deacetylase 8
Ligand
BDBM50138421
Substrate
Meas. Tech.
ChEBML_88029
IC50
4000±n/a nM
Citation
 Wu, TYHassig, CWu, YDing, SSchultz, PG Design, synthesis, and activity of HDAC inhibitors with a N-formyl hydroxylamine head group. Bioorg Med Chem Lett 14:449-53 (2003)  
Target
Name:
Histone deacetylase 8
Synonyms:
HD8 HDAC8_HUMAN Histone deacetylase 8 (HDAC-8) | Human HDAC8
Type:
Enzyme
Mol. Mass.:
41749.60
Organism:
Homo sapiens (Human)
Description:
Q9BY41
Residue:
377
  
Inhibitor
Name:
BDBM50138421
Synonyms:
7-(Formyl-hydroxy-amino)-heptanoic acid phenylamide | CHEMBL139193
Type:
Small organic molecule
Emp. Form.:
C14H20N2O3
Mol. Mass.:
264.3202
SMILES:
ON(CCCCCCC(=O)Nc1ccccc1)C=O
: