Target
Adenosine receptor A1
Ligand
BDBM50138523
Substrate
Meas. Tech.
ChEBML_29728
Ki
226±n/a nM
Citation
 Palle, VPVarkhedkar, VIbrahim, PAhmed, HLi, ZGao, ZOzeck, MWu, YZeng, DWu, LLeung, KChu, NZablocki, JA Affinity and intrinsic efficacy (IE) of 5'-carbamoyl adenosine analogues for the A1 adenosine receptor--efforts towards the discovery of a chronic ventricular rate control agent for the treatment of atrial fibrillation (AF). Bioorg Med Chem Lett 14:535-9 (2003)  
Target
Name:
Adenosine receptor A1
Synonyms:
A1 adenosine receptor (hA1) AA1R_HUMAN ADORA1 Adenosine A1-receptor Adenosine receptor A1 (hA1) | Adenosine transporter (AdT)
Type:
G Protein-Coupled Receptor (GPCR)
Mol. Mass.:
36520.92
Organism:
Homo sapiens (Human)
Description:
P30542
Residue:
326
  
Inhibitor
Name:
BDBM50138523
Synonyms:
CHEMBL358218 | Cyclopentyl-carbamic acid (2R,3S,4R)-5-{2-chloro-6-[(R)-(tetrahydro-furan-3-yl)amino]-purin-9-yl}-3,4-dihydroxy-tetrahydro-furan-2-ylmethyl ester
Type:
Small organic molecule
Emp. Form.:
C20H27ClN6O6
Mol. Mass.:
482.918
SMILES:
O[C@H]1[C@@H](O)C(O[C@@H]1COC(=O)NC1CCCC1)n1cnc2c(NC3CCOC3)nc(Cl)nc12
: