Target
Sodium- and chloride-dependent glycine transporter 2
Ligand
BDBM50138569
Substrate
Meas. Tech.
ChEBML_70977
IC50
89±n/a nM
Citation
 Ho, KKAppell, KCBaldwin, JJBohnstedt, ACDong, GGuo, THorlick, RIslam, KRKultgen, SGMasterson, CMMcDonald, EMcMillan, KMorphy, JRRankovic, ZSundaram, HWebb, M 2-(Aminomethyl)-benzamide-based glycine transporter type-2 inhibitors. Bioorg Med Chem Lett 14:545-8 (2003)  
Target
Name:
Sodium- and chloride-dependent glycine transporter 2
Synonyms:
GLYT2 NET1 SLC6A5 | Sodium- and chloride-dependent glycine transporter 2
Type:
Enzyme Catalytic Domain
Mol. Mass.:
87438.56
Organism:
Homo sapiens (Human)
Description:
Glycine-2-transporter 0 HUMAN::Q9Y345
Residue:
797
  
Inhibitor
Name:
BDBM50138569
Synonyms:
2-(7-Hydroxy-3,4-dihydro-1H-isoquinolin-2-ylmethyl)-N-(4-phenyl-butyl)-benzamide | CHEMBL357936
Type:
Small organic molecule
Emp. Form.:
C27H30N2O2
Mol. Mass.:
414.5393
SMILES:
Oc1ccc2CCN(Cc3ccccc3C(=O)NCCCCc3ccccc3)Cc2c1
: