Target
Hormone-sensitive lipase
Ligand
BDBM50138736
Substrate
Meas. Tech.
ChEMBL_88051 (CHEMBL693215)
IC50
2000±n/a nM
Citation
 Ebdrup, SSørensen, LGOlsen, OHJacobsen, P Synthesis and structure-activity relationship for a novel class of potent and selective carbamoyl-triazole based inhibitors of hormone sensitive lipase. J Med Chem 47:400-10 (2004)  
Target
Name:
Hormone-sensitive lipase
Synonyms:
HSL Hormone-sensitive lipase (HSL) LIPS_HUMAN
Type:
Protein
Mol. Mass.:
116599.07
Organism:
Homo sapiens (Human)
Description:
Q05469
Residue:
1076
  
Inhibitor
Name:
BDBM50138736
Synonyms:
(3-(4-chlorophenyl)-5-(methylthio)-1H-1,2,4-triazol-1-yl)(morpholino)methanone [3-(4-Chloro-phenyl)-5-methylsulfanyl-[1,2,4]triazol-1-yl]-morpholin-4-yl-methanone
Type:
Small organic molecule
Emp. Form.:
C14H15ClN4O2S
Mol. Mass.:
338.813
SMILES:
CSc1nc(nn1C(=O)N1CCOCC1)-c1ccc(Cl)cc1
: