Target
Cholinesterase
Ligand
BDBM50138737
Substrate
Meas. Tech.
ChEMBL_41584 (CHEMBL654878)
IC50
>50000±n/a nM
Citation
 Ebdrup, SSørensen, LGOlsen, OHJacobsen, P Synthesis and structure-activity relationship for a novel class of potent and selective carbamoyl-triazole based inhibitors of hormone sensitive lipase. J Med Chem 47:400-10 (2004)  
Target
Name:
Cholinesterase
Synonyms:
Acylcholine acylhydrolase Butyrylcholine esterase (BChE) Butyrylcholinesterase (BuChE) CHLE_HUMAN Cholinesterases Pseudocholinesterase
Type:
Homotetramer
Mol. Mass.:
68422.27
Organism:
Homo sapiens (Human)
Description:
P06276
Residue:
602
  
Inhibitor
Name:
BDBM50138737
Synonyms:
3-(4-Chloro-phenyl)-5-(2,2,2-trifluoro-ethylsulfanyl)-[1,2,4]triazole-1-carboxylic acid methyl-phenyl-amide CHEMBL131588
Type:
Small organic molecule
Emp. Form.:
C18H14ClF3N4OS
Mol. Mass.:
426.843
SMILES:
CN(C(=O)n1nc(nc1SCC(F)(F)F)-c1ccc(Cl)cc1)c1ccccc1
: