Target
Lipoprotein lipase
Ligand
BDBM50138734
Substrate
Meas. Tech.
ChEMBL_101166 (CHEMBL711027)
IC50
>10000±n/a nM
Citation
 Ebdrup, SSørensen, LGOlsen, OHJacobsen, P Synthesis and structure-activity relationship for a novel class of potent and selective carbamoyl-triazole based inhibitors of hormone sensitive lipase. J Med Chem 47:400-10 (2004)  
Target
Name:
Lipoprotein lipase
Synonyms:
LIPD LPL
Type:
PROTEIN
Mol. Mass.:
53173.96
Organism:
Homo sapiens (Human)
Description:
ChEMBL_1280894
Residue:
475
  
Inhibitor
Name:
BDBM50138734
Synonyms:
3-(3-(benzyloxy)phenyl)-5-ethoxy-1,3,4-oxadiazol-2(3H)-one CHEMBL133897
Type:
Small organic molecule
Emp. Form.:
C17H16N2O4
Mol. Mass.:
312.3199
SMILES:
CCOc1nn(-c2cccc(OCc3ccccc3)c2)c(=O)o1
: