Target
Hormone-sensitive lipase
Ligand
BDBM50138752
Substrate
Meas. Tech.
ChEMBL_88051 (CHEMBL693215)
IC50
>50000±n/a nM
Citation
 Ebdrup, SSørensen, LGOlsen, OHJacobsen, P Synthesis and structure-activity relationship for a novel class of potent and selective carbamoyl-triazole based inhibitors of hormone sensitive lipase. J Med Chem 47:400-10 (2004)  
Target
Name:
Hormone-sensitive lipase
Synonyms:
HSL Hormone-sensitive lipase (HSL) LIPS_HUMAN
Type:
Protein
Mol. Mass.:
116599.07
Organism:
Homo sapiens (Human)
Description:
Q05469
Residue:
1076
  
Inhibitor
Name:
BDBM50138752
Synonyms:
5-Methylsulfanyl-3-((E)-styryl)-[1,2,4]triazole-1-carboxylic acid dimethylamide N,N-dimethyl-5-(methylthio)-3-styryl-1H-1,2,4-triazole-1-carboxamide
Type:
Small organic molecule
Emp. Form.:
C14H16N4OS
Mol. Mass.:
288.368
SMILES:
CSc1nc(\C=C\c2ccccc2)nn1C(=O)N(C)C
: