Target
Acetylcholinesterase
Ligand
BDBM50138737
Substrate
Meas. Tech.
ChEMBL_29411 (CHEMBL643384)
IC50
>50000±n/a nM
Citation
 Ebdrup, SSørensen, LGOlsen, OHJacobsen, P Synthesis and structure-activity relationship for a novel class of potent and selective carbamoyl-triazole based inhibitors of hormone sensitive lipase. J Med Chem 47:400-10 (2004)  
Target
Name:
Acetylcholinesterase
Synonyms:
ACES_HUMAN Acetylcholinesterase (AChE) | Acetylcholinesterase (human AChE)
Type:
Enzyme
Mol. Mass.:
67792.70
Organism:
Homo sapiens (Human)
Description:
P22303
Residue:
614
  
Inhibitor
Name:
BDBM50138737
Synonyms:
3-(4-Chloro-phenyl)-5-(2,2,2-trifluoro-ethylsulfanyl)-[1,2,4]triazole-1-carboxylic acid methyl-phenyl-amide CHEMBL131588
Type:
Small organic molecule
Emp. Form.:
C18H14ClF3N4OS
Mol. Mass.:
426.843
SMILES:
CN(C(=O)n1nc(nc1SCC(F)(F)F)-c1ccc(Cl)cc1)c1ccccc1
: