Target
Metabotropic glutamate receptor 7
Ligand
BDBM50138781
Substrate
Meas. Tech.
ChEMBL_104483 (CHEMBL712464)
EC50
>100000±n/a nM
Citation
 Collado, IPedregal, CBueno, ABMarcos, AGonzález, RBlanco-Urgoiti, JPérez-Castells, JSchoepp, DDWright, RAJohnson, BGKingston, AEMoher, EDHoard, DWGriffey, KITizzano, JP (2S,1'S,2'R,3'R)-2-(2'-Carboxy-3'-hydroxymethylcyclopropyl) glycine is a highly potent group 2 and 3 metabotropic glutamate receptor agonist with oral activity. J Med Chem 47:456-66 (2004)  
Target
Name:
Metabotropic glutamate receptor 7
Synonyms:
GRM7_RAT Grm7 Metabotropic glutamate receptor 7 (mGlu7) mGlu7
Type:
Enzyme
Mol. Mass.:
102244.48
Organism:
Rattus norvegicus (Rat)
Description:
P35400
Residue:
915
  
Inhibitor
Name:
BDBM50138781
Synonyms:
(1S,2S,3R)-2-((S)-Amino-carboxy-methyl)-3-methyl-cyclopropanecarboxylic acid CHEMBL334160
Type:
Small organic molecule
Emp. Form.:
C7H11NO4
Mol. Mass.:
173.1665
SMILES:
C[C@@H]1[C@H]([C@H](N)C(O)=O)[C@H]1C(O)=O
: