Target
Metabotropic glutamate receptor 7
Ligand
BDBM50034504
Substrate
Meas. Tech.
ChEMBL_104483 (CHEMBL712464)
EC50
47000±n/a nM
Citation
 Collado, IPedregal, CBueno, ABMarcos, AGonzález, RBlanco-Urgoiti, JPérez-Castells, JSchoepp, DDWright, RAJohnson, BGKingston, AEMoher, EDHoard, DWGriffey, KITizzano, JP (2S,1'S,2'R,3'R)-2-(2'-Carboxy-3'-hydroxymethylcyclopropyl) glycine is a highly potent group 2 and 3 metabotropic glutamate receptor agonist with oral activity. J Med Chem 47:456-66 (2004)  
Target
Name:
Metabotropic glutamate receptor 7
Synonyms:
GRM7_RAT Grm7 Metabotropic glutamate receptor 7 (mGlu7) mGlu7
Type:
Enzyme
Mol. Mass.:
102244.48
Organism:
Rattus norvegicus (Rat)
Description:
P35400
Residue:
915
  
Inhibitor
Name:
BDBM50034504
Synonyms:
(1S,2S)-2-((S)-Amino-carboxy-methyl)-cyclopropanecarboxylic acid 2-(Amino-carboxy-methyl)-cyclopropanecarboxylic acid(2S,3S,4S-CCG) L-CCGI
Type:
Small organic molecule
Emp. Form.:
C6H9NO4
Mol. Mass.:
159.14
SMILES:
N[C@@H]([C@H]1C[C@@H]1C(O)=O)C(O)=O
: