Target
Metabotropic glutamate receptor 7
Ligand
BDBM50007548
Substrate
Meas. Tech.
ChEMBL_104483 (CHEMBL712464)
EC50
175000±n/a nM
Citation
 Collado, IPedregal, CBueno, ABMarcos, AGonzález, RBlanco-Urgoiti, JPérez-Castells, JSchoepp, DDWright, RAJohnson, BGKingston, AEMoher, EDHoard, DWGriffey, KITizzano, JP (2S,1'S,2'R,3'R)-2-(2'-Carboxy-3'-hydroxymethylcyclopropyl) glycine is a highly potent group 2 and 3 metabotropic glutamate receptor agonist with oral activity. J Med Chem 47:456-66 (2004)  
Target
Name:
Metabotropic glutamate receptor 7
Synonyms:
GRM7_RAT Grm7 Metabotropic glutamate receptor 7 (mGlu7) mGlu7
Type:
Enzyme
Mol. Mass.:
102244.48
Organism:
Rattus norvegicus (Rat)
Description:
P35400
Residue:
915
  
Inhibitor
Name:
BDBM50007548
Synonyms:
(S)-2-Amino-4-phosphono-butyric acid 2-Amino-3-(3,5-dioxo-[1,2,4]oxadiazolidin-2-yl)-propionic acid 2-Amino-4-phosphono-butyric acid(S-AP4) 2-amino-4-phosphonobutyric acid L-(+)-2-amino-4-phosphonobutyric acid L-AP4 | L-APB
Type:
Small organic molecule
Emp. Form.:
C4H10NO5P
Mol. Mass.:
183.0997
SMILES:
N[C@@H](CCP(O)(O)=O)C(O)=O
: