Target
Cannabinoid receptor 1
Ligand
BDBM50138906
Substrate
Meas. Tech.
ChEMBL_46448 (CHEMBL657896)
Ki
280±n/a nM
Citation
 Lange, JHCoolen, HKvan Stuivenberg, HHDijksman, JAHerremans, AHRonken, EKeizer, HGTipker, KMcCreary, ACVeerman, WWals, HCStork, BVerveer, PCden Hartog, APde Jong, NMAdolfs, TJHoogendoorn, JKruse, CG Synthesis, biological properties, and molecular modeling investigations of novel 3,4-diarylpyrazolines as potent and selective CB(1) cannabinoid receptor antagonists. J Med Chem 47:627-43 (2004)  
Target
Name:
Cannabinoid receptor 1
Synonyms:
CANN6 CB-R CNR CNR1_HUMAN Cannabinoid receptor Cannabinoid receptor 1 (brain)
Type:
G Protein-Coupled Receptor (GPCR)
Mol. Mass.:
52868.96
Organism:
Homo sapiens (Human)
Description:
P21554
Residue:
472
  
Inhibitor
Name:
BDBM50138906
Synonyms:
4-Chloro-N-[1-[3-(4-chloro-phenyl)-4-phenyl-4,5-dihydro-pyrazol-1-yl]-1-dimethylamino-meth-(E)-ylidene]-benzenesulfonamide | CHEMBL160214
Type:
Small organic molecule
Emp. Form.:
C24H22Cl2N4O2S
Mol. Mass.:
501.428
SMILES:
CN(C)C(=NS(=O)(=O)c1ccc(Cl)cc1)N1CC(C(=N1)c1ccc(Cl)cc1)c1ccccc1
: