Target
Kappa-type opioid receptor
Ligand
BDBM50139008
Substrate
Meas. Tech.
ChEMBL_145838 (CHEMBL755496)
Ki
83±n/a nM
Citation
 Tömböly, CKövér, KEPéter, ATourwé, DBiyashev, DBenyhe, SBorsodi, AAl-Khrasani, MRónai, AZTóth, G Structure-activity study on the Phe side chain arrangement of endomorphins using conformationally constrained analogues. J Med Chem 47:735-43 (2004)  
Target
Name:
Kappa-type opioid receptor
Synonyms:
KOR-1 OPIATE Kappa Opioid receptor Ror-d
Type:
G Protein-Coupled Receptor (GPCR)
Mol. Mass.:
42692.90
Organism:
Rattus norvegicus (rat)
Description:
P34975
Residue:
380
  
Inhibitor
Name:
BDBM50139008
Synonyms:
(S)-1-[(S)-2-Amino-3-(4-hydroxy-phenyl)-propionyl]-pyrrolidine-2-carboxylic acid [(1S,2S)-1-((S)-1-carbamoyl-2-phenyl-ethylcarbamoyl)-2-phenyl-propyl]-amide | CHEMBL423466
Type:
Small organic molecule
Emp. Form.:
C33H39N5O5
Mol. Mass.:
585.6933
SMILES:
C[C@H]([C@H](NC(=O)[C@@H]1CCCN1C(=O)[C@@H](N)Cc1ccc(O)cc1)C(=O)N[C@@H](Cc1ccccc1)C(N)=O)c1ccccc1
: