Target
Integrin alpha-4/beta-1
Ligand
BDBM50139080
Substrate
Meas. Tech.
ChEMBL_88913 (CHEMBL699815)
IC50
1600±n/a nM
Citation
 Dyatkin, ABHoekstra, WJKinney, WAKontoyianni, MSantulli, RJKimball, ESFisher, MCCarolyn Fisher, MProuty, SMAbraham, WMde Garavilla, LAndrade-Gordon, PHlasta, DJHe, WHornby, PJDamiano, BPMaryanoff, BE Aza-bicyclic amino acid sulfonamides as alpha(4)beta(1)/alpha(4)beta(7) integrin antagonists. Bioorg Med Chem Lett 14:591-6 (2004)  
Target
Name:
Integrin alpha-4/beta-1
Synonyms:
Fibronectin receptor beta/Integrin alpha-4 | Integrin alpha-4/beta-1
Type:
Mol. Mass.:
Description:
ASSAY_ID of EBI is 88912
Components:
This complex has 2 components.
Component 1
Name:
Integrin beta-1
Synonyms:
CD_antigen=CD29 Fibronectin receptor beta GPIIA ITGB1 MDF2 | MSK12
Type:
Enzyme
Mol. Mass.:
88400.38
Organism:
Homo sapiens (Human)
Description:
P05556
Residue:
798
  
Component 2
Name:
Integrin alpha-4
Synonyms:
CD49 antigen-like family member D CD49d antigen ITA4_HUMAN Integrin alpha-4 Integrin alpha-IV VLA-4 integrin alpha 4 precursor | integrin alpha-4 precursor
Type:
Membrane Protein
Mol. Mass.:
114897.35
Organism:
Homo sapiens (Human)
Description:
P13612
Residue:
1032
  
Inhibitor
Name:
BDBM50139080
Synonyms:
(S)-3-{4-[3-(2,6-Dichloro-phenyl)-ureido]-phenyl}-2-{[2-(toluene-4-sulfonyl)-2-aza-bicyclo[2.2.2]octane-3-carbonyl]-amino}-propionic acid | CHEMBL347669
Type:
Small organic molecule
Emp. Form.:
C31H32Cl2N4O6S
Mol. Mass.:
659.58
SMILES:
Cc1ccc(cc1)S(=O)(=O)N1C2CCC(CC2)C1C(=O)N[C@@H](Cc1ccc(NC(=O)Nc2c(Cl)cccc2Cl)cc1)C(O)=O
: