Target
Protein farnesyltransferase subunit beta/geranylgeranyltransferase type-1 subunit alpha
Ligand
BDBM50139189
Substrate
Meas. Tech.
ChEBML_70719
IC50
1.1±n/a nM
Citation
 Dinsmore, CJZartman, CBBergman, JMAbrams, MTBuser, CACulberson, JCDavide, JPEllis-Hutchings, MFernandes, CGraham, SLHartman, GDHuber, HELobell, RBMosser, SDRobinson, RGWilliams, TM Macrocyclic piperazinones as potent dual inhibitors of farnesyltransferase and geranylgeranyltransferase-I. Bioorg Med Chem Lett 14:639-43 (2004)  
Target
Name:
Protein farnesyltransferase subunit beta/geranylgeranyltransferase type-1 subunit alpha
Synonyms:
Farnesyltransferase (FTase) Protein Farnesyltransferase (PFT) Chain B | Protein farnesyltransferase
Type:
Protein Complex
Mol. Mass.:
Description:
To express recombinant enzyme in E. coli, the cloned human alpha and beta subunits were co-expressed from a plasmid, in which their expression was translationally coupled.
Components:
This complex has 2 components.
Component 1
Name:
Protein farnesyltransferase subunit beta
Synonyms:
CAAX farnesyltransferase subunit alpha FNTB FTase-alpha GGTase-I-alpha Protein farnesyl/geranylgeranyl transferase Protein farnesyltransferase subunit beta Protein farnesyltransferase/geranylgeranyltransferase type-1 subunit alpha Ras proteins prenyltransferase subunit beta | Type I protein geranyl-geranyltransferase subunit alpha
Type:
Enzyme Subunit
Mol. Mass.:
48766.02
Organism:
Homo sapiens (Human)
Description:
Protein farnesyltransferase subunit beta
Residue:
437
  
Component 2
Name:
Protein farnesyltransferase/geranylgeranyltransferase type-1 subunit alpha
Synonyms:
CAAX farnesyltransferase alpha subunit FNTA_HUMAN FTase-alpha Geranylgeranyl Transferase (GGTase-I) Chain A Protein Farnesyltransferase (PFT) Chain A Protein farnesyltransferase Protein farnesyltransferase/geranylgeranyltransferase type I alpha subunit | Ras proteins prenyltransferase alpha
Type:
Enzyme
Mol. Mass.:
44392.46
Organism:
Homo sapiens (Human)
Description:
Recombinant human FTase.
Residue:
379
  
Inhibitor
Name:
BDBM50139189
Synonyms:
4-bromo-23-oxo-8-oxa-1,15,17,21-tetraazapentacyclo[19.2.2.13,7.19,13.015,19]heptacosa-3(27),4,6,9(26),10,12,16,18-octaen-10-yl cyanide | CHEMBL346084
Type:
Small organic molecule
Emp. Form.:
C23H20BrN5O2
Mol. Mass.:
478.341
SMILES:
Brc1ccc2Oc3cc(Cn4cncc4CN4CCN(Cc1c2)C(=O)C4)ccc3C#N
: