Target
Prostaglandin G/H synthase 1
Ligand
BDBM50139247
Substrate
Meas. Tech.
ChEBML_159410
IC50
24000±n/a nM
Citation
 Gupta, KKaub, CJCarey, KNCasillas, EGSelinsky, BSLoll, PJ Manipulation of kinetic profiles in 2-aryl propionic acid cyclooxygenase inhibitors. Bioorg Med Chem Lett 14:667-71 (2004)  
Target
Name:
Prostaglandin G/H synthase 1
Synonyms:
COX1 Cyclooxygenase-1 (COX-1) PTGS1 | Prostaglandin G/H synthase (cyclooxygenase)
Type:
Protein
Mol. Mass.:
68868.60
Organism:
Ovis aries (Sheep)
Description:
Residue:
600
  
Inhibitor
Name:
BDBM50139247
Synonyms:
2-(2-Fluoro-biphenyl-4-yl)-N-methyl-propionamide | CHEMBL161481
Type:
Small organic molecule
Emp. Form.:
C16H16FNO
Mol. Mass.:
257.3027
SMILES:
CNC(=O)C(C)c1ccc(c(F)c1)-c1ccccc1
: