Target
Histamine H3 receptor
Ligand
BDBM50139287
Substrate
Meas. Tech.
ChEBML_86753
Ki
2.6±n/a nM
Citation
 Gfesser, GAZhang, HDinges, JFox, GBPan, JBEsbenshade, TAYao, BBWitte, DMiller, TRKang, CHKrueger, KMBennani, YLHancock, AAFaghih, R Structure-activity relationships of non-imidazole H(3) receptor ligands. Part 3: 5-Substituted 3-phenyl-1,2,4-oxadiazoles as potent antagonists. Bioorg Med Chem Lett 14:673-6 (2004)  
Target
Name:
Histamine H3 receptor
Synonyms:
HH3R Hrh3
Type:
G Protein-Coupled Receptor (GPCR)
Mol. Mass.:
48607.98
Organism:
Rattus norvegicus (rat)
Description:
Residue:
445
  
Inhibitor
Name:
BDBM50139287
Synonyms:
CHEMBL161568 | Pentanoic acid [(R)-2-(4-{3-[4-(5-cyclopentylmethyl-[1,2,4]oxadiazol-3-yl)-3-fluoro-phenoxy]-propyl}-piperazin-1-yl)-1-methyl-2-oxo-ethyl]-amide
Type:
Small organic molecule
Emp. Form.:
C29H42FN5O4
Mol. Mass.:
543.6733
SMILES:
CCCCC(=O)N[C@H](C)C(=O)N1CCN(CCCOc2ccc(-c3noc(CC4CCCC4)n3)c(F)c2)CC1
: