Target
5-hydroxytryptamine receptor 7
Ligand
BDBM50139361
Substrate
Meas. Tech.
ChEBML_3690
Ki
4.1±n/a nM
Citation
 Thomson, CGBeer, MSCurtis, NRDiggle, HJHandford, EKulagowski, JJ Thiazoles and thiopyridines: novel series of high affinity h5HT(7) ligands. Bioorg Med Chem Lett 14:677-80 (2004)  
Target
Name:
5-hydroxytryptamine receptor 7
Synonyms:
5-HT-7 5-HT7 5-HT7S 5HT7 HTR7 | Serotonin receptor 7
Type:
G Protein-Coupled Receptor (GPCR)
Mol. Mass.:
53573.08
Organism:
Homo sapiens (Human)
Description:
P34969
Residue:
479
  
Inhibitor
Name:
BDBM50139361
Synonyms:
2-(6-Bromopyridin-2-ylthio)-N,N-dimethylethanamine [2-(6-Bromo-pyridin-2-ylsulfanyl)-ethyl]-dimethyl-amine
Type:
Small organic molecule
Emp. Form.:
C9H13BrN2S
Mol. Mass.:
261.182
SMILES:
CN(C)CCSc1cccc(Br)n1
: