Target
Adenosine receptor A2a
Ligand
BDBM50139718
Substrate
Meas. Tech.
ChEBML_29998
Ki
400±n/a nM
Citation
 Alanine, AAnselm, LSteward, LThomi, SVifian, WGroaning, MD Synthesis and SAR evaluation of 1,2,4-triazoles as A(2A) receptor antagonists. Bioorg Med Chem Lett 14:817-21 (2004)  
Target
Name:
Adenosine receptor A2a
Synonyms:
AA2AR_RAT Adenosine A2 receptor Adenosine Receptors A2a (A2a) Adenosine receptors A2a Rat striatal adenosine A2a receptor
Type:
G Protein-Coupled Receptor (GPCR)
Mol. Mass.:
45015.65
Organism:
Rattus norvegicus (rat)
Description:
Rat A2A receptors expressed in CHO cells.
Residue:
410
  
Inhibitor
Name:
BDBM50139718
Synonyms:
5-(3-Methoxy-phenyl)-3-naphthalen-2-ylmethyl-1H-[1,2,4]triazole | CHEMBL167343
Type:
Small organic molecule
Emp. Form.:
C20H17N3O
Mol. Mass.:
315.3685
SMILES:
COc1cccc(c1)-c1nnc(Cc2ccc3ccccc3c2)[nH]1
: