Target
Adenosine receptor A1
Ligand
BDBM82015
Substrate
Meas. Tech.
ChEMBL_29175 (CHEMBL641070)
Ki
89±n/a nM
Citation
 Yan, LMüller, CE Preparation, properties, reactions, and adenosine receptor affinities of sulfophenylxanthine nitrophenyl esters: toward the development of sulfonic acid prodrugs with peroral bioavailability. J Med Chem 47:1031-43 (2004)  
Target
Name:
Adenosine receptor A1
Synonyms:
AA1R_RAT ADENOSINE A1 high Adenosine A1 receptor (A1) Adenosine receptors A1 | Adora1
Type:
Protein
Mol. Mass.:
36704.13
Organism:
Rattus norvegicus (rat)
Description:
Residue:
326
  
Inhibitor
Name:
BDBM82015
Synonyms:
1,3-Dimethyl-8-phenyl-3,9-dihydro-purine-2,6-dione CAS_1922 NSC_1922
Type:
Small organic molecule
Emp. Form.:
C13H12N4O2
Mol. Mass.:
256.26
SMILES:
Cn1c2nc([nH]c2c(=O)n(C)c1=O)-c1ccccc1
: