Target
Adenosine receptor A1
Ligand
BDBM50018152
Substrate
Meas. Tech.
ChEMBL_29175 (CHEMBL641070)
Ki
67±n/a nM
Citation
 Yan, LMüller, CE Preparation, properties, reactions, and adenosine receptor affinities of sulfophenylxanthine nitrophenyl esters: toward the development of sulfonic acid prodrugs with peroral bioavailability. J Med Chem 47:1031-43 (2004)  
Target
Name:
Adenosine receptor A1
Synonyms:
AA1R_RAT ADENOSINE A1 high Adenosine A1 receptor (A1) Adenosine receptors A1 | Adora1
Type:
Protein
Mol. Mass.:
36704.13
Organism:
Rattus norvegicus (rat)
Description:
Residue:
326
  
Inhibitor
Name:
BDBM50018152
Synonyms:
8-Phenyl-1-propyl-3,7-dihydro-purine-2,6-dione | CHEMBL274855
Type:
Small organic molecule
Emp. Form.:
C14H14N4O2
Mol. Mass.:
270.2866
SMILES:
CCCn1c(=O)[nH]c2nc([nH]c2c1=O)-c1ccccc1
: