Target
Corticotropin-releasing factor receptor 1
Ligand
BDBM50139900
Substrate
Meas. Tech.
ChEMBL_51110 (CHEMBL666548)
Ki
>1000±n/a nM
Citation
 Yamada, YMizutani, KMizusawa, YHantani, YTanaka, MTanaka, YTomimoto, MSugawara, MImai, NYamada, HOkajima, NHaruta, J New class of corticotropin-releasing factor (CRF) antagonists: small peptides having high binding affinity for CRF receptor. J Med Chem 47:1075-8 (2004)  
Target
Name:
Corticotropin-releasing factor receptor 1
Synonyms:
CRF-R CRF1 CRFR1 CRH-R 1 CRHR1 Corticotropin-releasing factor receptor 1 (CRF-1) Corticotropin-releasing hormone receptor 1
Type:
Enzyme
Mol. Mass.:
50744.31
Organism:
Homo sapiens (Human)
Description:
P34998
Residue:
444
  
Inhibitor
Name:
BDBM50139900
Synonyms:
Ac-(Glu-Asp-His-Lys)-Asn-Arg-Lys-Leu-Nle-Glu-Ile-Ile-NH2 | CHEMBL427945
Type:
Small organic molecule
Emp. Form.:
C71H120N20O19
Mol. Mass.:
1557.8351
SMILES:
CC[C@H](C)[C@H](NC(=O)[C@@H](NC(=O)[C@H](CCC(O)=O)NC(=O)C(CCCCC(=O)[C@H](CC(C)C)NC(=O)[C@H](CCCCN)NC(=O)[C@H](CCCNC(N)=N)NC(=O)[C@H](CC(N)=O)NC(=O)[C@@H]1CCCCNC(=O)CC[C@@H](NC(C)=O)C(=O)N[C@H](CC(O)=O)C(=O)N[C@@H](Cc2cnc[nH]2)C(=O)N1)C(C)C)[C@@H](C)CC)C(N)=O
: