Target
Sodium-dependent noradrenaline transporter
Ligand
BDBM50139958
Substrate
Meas. Tech.
ChEMBL_144970 (CHEMBL753703)
Ki
5.6±n/a nM
Citation
 Plisson, CMcConathy, JMartarello, LMalveaux, EJCamp, VMWilliams, LVotaw, JRGoodman, MM Synthesis, radiosynthesis, and biological evaluation of carbon-11 and iodine-123 labeled 2beta-carbomethoxy-3beta-[4'-((Z)-2-haloethenyl)phenyl]tropanes: candidate radioligands for in vivo imaging of the serotonin transporter. J Med Chem 47:1122-35 (2004)  
Target
Name:
Sodium-dependent noradrenaline transporter
Synonyms:
Monoamine transporter NET Noradrenaline Transporter (NET) Norepinephrine transporter protein (NET) SLC6A2 Sodium-dependent noradrenaline transporter (NET) | Solute carrier family 6 member 2
Type:
Multi-pass membrane protein
Mol. Mass.:
69337.72
Organism:
Homo sapiens (Human)
Description:
P23975
Residue:
617
  
Inhibitor
Name:
BDBM50139958
Synonyms:
3-[4-(2,2-Dibromo-vinyl)-phenyl]-8-aza-bicyclo[3.2.1]octane-2-carboxylic acid methyl ester | CHEMBL14257
Type:
Small organic molecule
Emp. Form.:
C17H19Br2NO2
Mol. Mass.:
429.146
SMILES:
[#6]-[#8]-[#6](=O)-[#6]-1-[#6]-2-[#6]-[#6]-[#6](-[#6]-[#6]-1-c1ccc(\[#6]=[#6](/Br)Br)cc1)-[#7]-2
: