Target
Neuronal acetylcholine receptor subunit alpha-3/beta-2
Ligand
BDBM50140091
Substrate
Meas. Tech.
ChEMBL_143243 (CHEMBL752531)
IC50
10±n/a nM
Citation
 Loughnan, MLNicke, AJones, AAdams, DJAlewood, PFLewis, RJ Chemical and functional identification and characterization of novel sulfated alpha-conotoxins from the cone snail Conus anemone. J Med Chem 47:1234-41 (2004)  
Target
Name:
Neuronal acetylcholine receptor subunit alpha-3/beta-2
Synonyms:
Neuronal acetylcholine receptor Alpha-3/Beta-2 Neuronal acetylcholine receptor; alpha3/beta2 | nAChR subtypes alpha3 beta2
Type:
Protein
Mol. Mass.:
Description:
Components:
This complex has 2 components.
Component 1
Name:
Neuronal acetylcholine receptor subunit alpha-3
Synonyms:
ACHA3_RAT Chrna3
Type:
Enzyme
Mol. Mass.:
56995.52
Organism:
Rattus norvegicus (Rat)
Description:
P04757
Residue:
499
  
Component 2
Name:
Neuronal acetylcholine receptor subunit beta-2
Synonyms:
ACHB2_RAT Chrnb2 Neuronal acetylcholine receptor non-alpha-1 chain
Type:
Enzyme
Mol. Mass.:
56910.32
Organism:
Rattus norvegicus (Rat)
Description:
P12390
Residue:
500
  
Inhibitor
Name:
BDBM50140091
Synonyms:
CHEMBL413505 | IRDgammaCCSNPACRVNNOHVC#
Type:
Small organic molecule
Emp. Form.:
C84H137N31O30S4
Mol. Mass.:
2189.436
SMILES:
CC[C@H](C)[C@H](N)C(=O)N[C@@H](CCCNC(N)=N)C(=O)N[C@@H](CC(O)=O)C(=O)NC(CC(C(O)=O)C(O)=O)C(=O)N[C@@H](CS)C(=O)N[C@@H](CS)C(=O)N[C@@H](CO)C(=O)N[C@@H](CC(N)=O)C(=O)N1CCC[C@H]1C(=O)N[C@@H](C)C(=O)N[C@@H](CS)C(=O)N[C@@H](CCCNC(N)=N)C(=O)N[C@@H](C(C)C)C(=O)N[C@@H](CC(N)=O)C(=O)N[C@@H](CC(N)=O)C(=O)N1CC(O)CC1C(=O)N[C@@H](Cc1cnc[nH]1)C(=O)N[C@@H](C(C)C)C(=O)N[C@@H](CS)C(N)=O
: