Target
Vitamin K-dependent protein C
Ligand
BDBM50140380
Substrate
Meas. Tech.
ChEBML_27868
IC50
>10000±n/a nM
Citation
 Jia, ZJWu, YHuang, WZhang, PClizbe, LAGoldman, EASinha, UArfsten, AEEdwards, STAlphonso, MHutchaleelaha, AScarborough, RMZhu, BY 1-(2-Naphthyl)-1H-pyrazole-5-carboxylamides as potent factor Xa inhibitors. Part 2: A survey of P4 motifs. Bioorg Med Chem Lett 14:1221-7 (2004)  
Target
Name:
Vitamin K-dependent protein C
Synonyms:
Activated protein C cofactor Apolipoprotein H Blood coagulation factor XIV Coagulation factor V heavy chain Endothelial protein C receptor PROC_HUMAN Vitamin K-dependent protein C precursor
Type:
Enzyme
Mol. Mass.:
52067.73
Organism:
Homo sapiens (Human)
Description:
Residue:
461
  
Inhibitor
Name:
BDBM50140380
Synonyms:
2-(3-Fluoro-naphthalen-2-yl)-5-methyl-2H-pyrazole-3-carboxylic acid (2'-aminomethyl-3-fluoro-biphenyl-4-yl)-amide | CHEMBL20934
Type:
Small organic molecule
Emp. Form.:
C28H22F2N4O
Mol. Mass.:
468.4973
SMILES:
Cc1cc(C(=O)Nc2ccc(cc2F)-c2ccccc2CN)n(n1)-c1cc2ccccc2cc1F
: